# import boostrap.\_ not found

**URL:** <https://community.gatling.io/t/import-boostrap-not-found/166>\
**Category:** Gatling (Open-Source)\
**Created:** [November 14, 2012, 12:48pm UTC](https://community.gatling.io/t/import-boostrap-not-found/166 "2012-11-14T12:48:34Z")\
**Posts on this page:** 9\
**Page:** 1

<div class="post-metadata">

**Author:** ![Gregory\_Bougeard](https://avatars.discourse-cdn.com/v4/letter/g/bc8723/32.png) [@Gregory\_Bougeard](https://community.gatling.io/u/Gregory_Bougeard)\
**Post date:** [November 14, 2012, 12:48pm UTC](https://community.gatling.io/t/import-boostrap-not-found/166/1 "2012-11-14T12:48:34Z")

</div>

Hi,

I have a weird issue

The ZincCompiler give me an error on the import boostrap.\_ line :

[INFO] Exception in thread “main” Compilation failed  
[INFO] at sbt.compiler.AnalyzingCompiler.call(AnalyzingCompiler.scala:76)  
[INFO] 13:46:01.257 [main][ERROR][slf4j.scala:105] c.e.e.g.a.ZincCompiler$ - /home/gbougeard/git/IT/gatling-test/src/main/resources/simulations/soap/TransatSimulation.scala:8: not found: object boostrap at sbt.compiler.AnalyzingCompiler.compile(AnalyzingCompiler.scala:35)  
[INFO]  
[INFO] 13:46:01.259 [main][ERROR][slf4j.scala:105] c.e.e.g.a.ZincCompiler$ - import boostrap.\_ at sbt.compiler.AnalyzingCompiler.compile(AnalyzingCompiler.scala:29)  
[INFO] 13:46:01.260 [main][ERROR][slf4j.scala:105] c.e.e.g.a.ZincCompiler$ - ^  
[INFO] 13:46:01.275 [main][ERROR][slf4j.scala:105] c.e.e.g.a.ZincCompiler$ - one error found

I’m using the maven plugin with gatling 1.3.4 (and maven3).

---

<div class="post-metadata">

**Author:** ![Excilys](https://avatars.discourse-cdn.com/v4/letter/e/8797f3/32.png) [@Excilys](https://community.gatling.io/u/Excilys)\
**Post date:** [November 14, 2012, 12:57pm UTC](https://community.gatling.io/t/import-boostrap-not-found/166/2 "2012-11-14T12:57:14Z")

</div>

O\_o  
Can you send your simulation, please?

---

<div class="post-metadata">

**Author:** ![Excilys](https://avatars.discourse-cdn.com/v4/letter/e/8797f3/32.png) [@Excilys](https://community.gatling.io/u/Excilys)\
**Post date:** [November 14, 2012, 1:03pm UTC](https://community.gatling.io/t/import-boostrap-not-found/166/3 "2012-11-14T13:03:58Z")

</div>

Are you 100% sure you use Gatling 1.3.4?

---

<div class="post-metadata">

**Author:** ![Gregory\_Bougeard](https://avatars.discourse-cdn.com/v4/letter/g/bc8723/32.png) [@Gregory\_Bougeard](https://community.gatling.io/u/Gregory_Bougeard)\
**Post date:** [November 14, 2012, 1:06pm UTC](https://community.gatling.io/t/import-boostrap-not-found/166/4 "2012-11-14T13:06:48Z")

</div>

I’m getting a 340 error when I try to attach files ☹

[INFO] — gatling-maven-plugin:1.3.4:execute (default-cli) @ gatling-tests —

---

<div class="post-metadata">

**Author:** ![Gregory\_Coutant](https://avatars.discourse-cdn.com/v4/letter/g/8c91f0/32.png) [@Gregory\_Coutant](https://community.gatling.io/u/Gregory_Coutant)\
**Post date:** [November 14, 2012, 1:08pm UTC](https://community.gatling.io/t/import-boostrap-not-found/166/5 "2012-11-14T13:08:06Z")

</div>

Be careful, it’s : import boo **t** strap.\_

---

<div class="post-metadata">

**Author:** ![Gregory\_Bougeard](https://avatars.discourse-cdn.com/v4/letter/g/bc8723/32.png) [@Gregory\_Bougeard](https://community.gatling.io/u/Gregory_Bougeard)\
**Post date:** [November 14, 2012, 1:10pm UTC](https://community.gatling.io/t/import-boostrap-not-found/166/6 "2012-11-14T13:10:48Z")

</div>

I sent you an email with the files attached.

---

<div class="post-metadata">

**Author:** ![Audrey\_Neveu](https://avatars.discourse-cdn.com/v4/letter/a/b9bd4f/32.png) [@Audrey\_Neveu](https://community.gatling.io/u/Audrey_Neveu)\
**Post date:** [June 26, 2013, 2:48pm UTC](https://community.gatling.io/t/import-boostrap-not-found/166/7 "2013-06-26T14:48:32Z")

</div>

Hi all,

Have you found where it comes from ? We are encountering the same issue, but with gatling 1.4.2 and scala-maven-plugin 3.0.1.

Thanks for your help,

---

<div class="post-metadata">

**Author:** ![Excilys](https://avatars.discourse-cdn.com/v4/letter/e/8797f3/32.png) [@Excilys](https://community.gatling.io/u/Excilys)\
**Post date:** [June 26, 2013, 3:01pm UTC](https://community.gatling.io/t/import-boostrap-not-found/166/8 "2013-06-26T15:01:22Z")

</div>

Hi Audrey,

Nice to see you there!

Have you tried cleaning up the target dir? Zinc (the incremental Scala compiler) caches things there.

Cheers,

Stéphane

---

<div class="post-metadata">

**Author:** ![Gregory\_Bougeard](https://avatars.discourse-cdn.com/v4/letter/g/bc8723/32.png) [@Gregory\_Bougeard](https://community.gatling.io/u/Gregory_Bougeard)\
**Post date:** [June 26, 2013, 3:03pm UTC](https://community.gatling.io/t/import-boostrap-not-found/166/9 "2013-06-26T15:03:26Z")

</div>

I found the Stéphane mail I got :

verifiy the syntax :

import boostrap or import boo **t** strap

😉
